BDBM50050669 CHEMBL296210::{(S)-1-[1-(7-Hydroxy-heptylcarbamoyl)-1-methyl-2-phenyl-ethylcarbamoyl]-2-phenyl-ethyl}-carbamic acid tert-butyl ester
SMILES CC(C)(C)OC(=O)N[C@@H](Cc1ccccc1)C(=O)NC(C)(Cc1ccccc1)C(=O)NCCCCCCCO
InChI Key InChIKey=XFGBWRHTRJIBMS-PAMMARIWSA-N
Data  1 IC50
  Tab Delimited (TSV)   2D SDfile   Computed 3D by Vconf -m prep SDfile
Find this compound or compounds like it in BindingDB:
Activity Spreadsheet -- Enzyme Inhibition Constant Data from BindingDB
Found 1 hit for monomerid = 50050669
TargetNeuromedin-K receptor(Homo sapiens (Human))
Cambridge University Forvie Site
Curated by ChEMBL
LigandPNGBDBM50050669(CHEMBL296210 | {(S)-1-[1-(7-Hydroxy-heptylcarbamoy...)
Affinity DataIC50:  111nM. Assay description: Compound was tested for the inhibition of [125I]-[MePhe7]-NKB binding to cloned human Tachykinin receptor 3 in CHO cell lines
In DepthDetails ArticlePubMed