BDBM50051448 2-(2-Dodecyl-2H-tetrazol-5-yl)-2-(4-methoxy-phenyl)-N-(2,4,6-trimethoxy-phenyl)-acetamide::CHEMBL305912
SMILES CCCCCCCCCCCCn1nnc(n1)C(C(=O)Nc1c(OC)cc(OC)cc1OC)c1ccc(OC)cc1
InChI Key InChIKey=UFVSAVAXDLPGAB-UHFFFAOYSA-N
Data  1 IC50
  Tab Delimited (TSV)   2D SDfile   Computed 3D by Vconf -m prep SDfile
Find this compound or compounds like it in BindingDB:
Activity Spreadsheet -- Enzyme Inhibition Constant Data from BindingDB
Found 1 hit for monomerid = 50051448
TargetSterol O-acyltransferase 1(Rattus norvegicus)
Warner-Lambert
Curated by ChEMBL
LigandPNGBDBM50051448(2-(2-Dodecyl-2H-tetrazol-5-yl)-2-(4-methoxy-phenyl...)
Affinity DataIC50:  200nM. Assay description: In vitro inhibitory activity against acyl coenzyme A:cholesterol acyltransferase 1 of liver microsomes isolated from cholesterol-fed rats.
In DepthDetails ArticlePubMed