BDBM50051462 2-Phenyl-N-(2,4,6-trimethoxy-phenyl)-2-(2-undec-10-enyl-2H-tetrazol-5-yl)-acetamide::CHEMBL76950
SMILES COc1cc(OC)c(NC(=O)C(c2nnn(CCCCCCCCCC=C)n2)c2ccccc2)c(OC)c1
InChI Key InChIKey=GDZDTPJQJYHNSU-UHFFFAOYSA-N
Data  1 IC50
  Tab Delimited (TSV)   2D SDfile   Computed 3D by Vconf -m prep SDfile
Find this compound or compounds like it in BindingDB:
Activity Spreadsheet -- Enzyme Inhibition Constant Data from BindingDB
Found 1 hit for monomerid = 50051462
TargetSterol O-acyltransferase 1(Rattus norvegicus)
Warner-Lambert
Curated by ChEMBL
LigandPNGBDBM50051462(2-Phenyl-N-(2,4,6-trimethoxy-phenyl)-2-(2-undec-10...)
Affinity DataIC50:  54nM. Assay description: In vitro inhibitory activity against acyl coenzyme A:cholesterol acyltransferase 1 of liver microsomes isolated from cholesterol-fed rats.
In DepthDetails ArticlePubMed