BDBM50051471 CHEMBL75694::N-(5,7-Dimethyl-[1,8]naphthyridin-2-yl)-2-(2-dodecyl-2H-tetrazol-5-yl)-2-phenyl-acetamide
SMILES CCCCCCCCCCCCn1nnc(n1)C(C(=O)Nc1ccc2c(C)cc(C)nc2n1)c1ccccc1
InChI Key InChIKey=MJIYUFBEGZDHKC-UHFFFAOYSA-N
Data  1 IC50
  Tab Delimited (TSV)   2D SDfile   Computed 3D by Vconf -m prep SDfile
Find this compound or compounds like it in BindingDB:
Activity Spreadsheet -- Enzyme Inhibition Constant Data from BindingDB
Found 1 hit for monomerid = 50051471
TargetSterol O-acyltransferase 1(Rattus norvegicus)
Warner-Lambert
Curated by ChEMBL
LigandPNGBDBM50051471(CHEMBL75694 | N-(5,7-Dimethyl-[1,8]naphthyridin-2-...)
Affinity DataIC50:  1.54E+3nM. Assay description: In vitro inhibitory activity against acyl coenzyme A:cholesterol acyltransferase 1 of liver microsomes isolated from cholesterol-fed rats.
In DepthDetails ArticlePubMed