BDBM50051621 2-hydroxy-3-[1-(3-hydroxy-1,4-dioxo-1,4-dihydro-2-naphthalenyl)ethyl]-1,4-dihydro-1,4-naphthalenedione::CHEMBL310847::NSC-92073
SMILES CC(=C1C(=O)C(=O)c2ccccc2C1=O)c1c(O)c(O)c2ccccc2c1O
InChI Key InChIKey=WNAMFPIJVWDCGT-UHFFFAOYSA-N
Data  2 IC50
  Tab Delimited (TSV)   2D SDfile   Computed 3D by Vconf -m prep SDfile
Find this compound or compounds like it in BindingDB:
Activity Spreadsheet -- Enzyme Inhibition Constant Data from BindingDB
Found 2 hits for monomerid = 50051621
TargetIntegrase(Human immunodeficiency virus 1)
National Cancer Institute-Bethesda
Curated by ChEMBL
LigandPNGBDBM50051621(2-hydroxy-3-[1-(3-hydroxy-1,4-dioxo-1,4-dihydro-2-...)
Affinity DataIC50: >1.00E+5nM. Assay description: Inhibitory activity against HIV-1 integrase
In DepthDetails ArticlePubMed
TargetIntegrase(Human immunodeficiency virus 1)
National Cancer Institute-Bethesda
Curated by ChEMBL
LigandPNGBDBM50051621(2-hydroxy-3-[1-(3-hydroxy-1,4-dioxo-1,4-dihydro-2-...)
Affinity DataIC50: >1.00E+5nM. Assay description: Inhibitory activity against HIV-1 integrase
In DepthDetails ArticlePubMed