BDBM50051916 CHEMBL33187::N*6*-(4-Phenoxy-benzyl)-pyrido[2,3-d]pyrimidine-2,4,6-triamine
SMILES Nc1nc(N)c2cc(NCc3ccc(Oc4ccccc4)cc3)cnc2n1
InChI Key InChIKey=GFZYQSFYVKLQKJ-UHFFFAOYSA-N
Data  6 IC50
  Tab Delimited (TSV)   2D SDfile   Computed 3D by Vconf -m prep SDfile
Find this compound or compounds like it in BindingDB:
Activity Spreadsheet -- Enzyme Inhibition Constant Data from BindingDB
Found 6 hits for monomerid = 50051916
TargetBifunctional dihydrofolate reductase-thymidylate synthase(Toxoplasma gondii)
Duquesne University
Curated by ChEMBL
LigandPNGBDBM50051916(CHEMBL33187 | N*6*-(4-Phenoxy-benzyl)-pyrido[2,3-d...)
Affinity DataIC50:  3.70E+3nM. Assay description: Inhibitory activity against Toxoplasma gondii dihydrofolate reductase (in 90 microM dihydrofolic acid)
In DepthDetails ArticlePubMed
TargetDihydrofolate reductase(Rattus norvegicus (rat))
Duquesne University
Curated by ChEMBL
LigandPNGBDBM50051916(CHEMBL33187 | N*6*-(4-Phenoxy-benzyl)-pyrido[2,3-d...)
Affinity DataIC50:  2.90E+3nM. Assay description: Inhibitory activity against rat liver dihydrofolate reductase (in 90 microM dihydrofolic acid)
In DepthDetails ArticlePubMed
TargetBifunctional dihydrofolate reductase-thymidylate synthase(Toxoplasma gondii)
Duquesne University
Curated by ChEMBL
LigandPNGBDBM50051916(CHEMBL33187 | N*6*-(4-Phenoxy-benzyl)-pyrido[2,3-d...)
Affinity DataIC50:  3.70E+3nM. Assay description: Inhibition of Toxoplasma gondii dihydrofolate reductase
In DepthDetails ArticlePubMed
TargetDihydrofolate reductase(Pneumocystis carinii)
Duquesne University
Curated by ChEMBL
LigandPNGBDBM50051916(CHEMBL33187 | N*6*-(4-Phenoxy-benzyl)-pyrido[2,3-d...)
Affinity DataIC50:  2.43E+4nM. Assay description: Inhibition of Pneumocystis carinii dihydrofolate reductase
In DepthDetails ArticlePubMed
TargetDihydrofolate reductase(Rattus norvegicus (rat))
Duquesne University
Curated by ChEMBL
LigandPNGBDBM50051916(CHEMBL33187 | N*6*-(4-Phenoxy-benzyl)-pyrido[2,3-d...)
Affinity DataIC50:  2.90E+3nM. Assay description: Inhibition of rat liver dihydrofolate reductase
In DepthDetails ArticlePubMed
TargetDihydrofolate reductase(Pneumocystis carinii)
Duquesne University
Curated by ChEMBL
LigandPNGBDBM50051916(CHEMBL33187 | N*6*-(4-Phenoxy-benzyl)-pyrido[2,3-d...)
Affinity DataIC50:  2.43E+4nM. Assay description: Inhibitory activity against Pneumocystis carinii dihydrofolate reductase (in 90 microM dihydrofolic acid)
In DepthDetails ArticlePubMed