BDBM50052206 CHEMBL3318391
SMILES [Cl-].Fc1ccccc1C[n+]1ccc(\C=C2\C(=O)Nc3ccccc23)cc1
InChI Key InChIKey=CMEGVZCWMNLLLK-UHFFFAOYSA-O
Data  2 IC50
  Tab Delimited (TSV)   2D SDfile   Computed 3D by Vconf -m prep SDfile
Find this compound or compounds like it in BindingDB:
Activity Spreadsheet -- Enzyme Inhibition Constant Data from BindingDB
Found 2 hits for monomerid = 50052206
TargetCholinesterase(Equus caballus (Horse))
Yazd University
Curated by ChEMBL
LigandPNGBDBM50052206(CHEMBL3318391)
Affinity DataIC50:  4.27E+3nM. Assay description: Inhibition of equine serum BuChE using butyrylthiocholine iodide substrate by Ellman method based spectrophotometry
In DepthDetails ArticlePubMed
TargetAcetylcholinesterase(Electrophorus electricus (Electric eel))
Yazd University
Curated by ChEMBL
LigandPNGBDBM50052206(CHEMBL3318391)
Affinity DataIC50:  1.30nM. Assay description: Inhibition of electric eel AChE using acetylthiocholine iodide substrate by Ellman method based spectrophotometry
In DepthDetails ArticlePubMed