BDBM50052250 CHEMBL3318465
SMILES OC1=C(Sc2ccccc2Cl)C(=O)CC(C1)c1ccccc1Cl
InChI Key InChIKey=UCSUKGJYCVAUPJ-UHFFFAOYSA-N
Data  2 IC50  1 Kd
  Tab Delimited (TSV)   2D SDfile   Computed 3D by Vconf -m prep SDfile
Find this compound or compounds like it in BindingDB:
Activity Spreadsheet -- Enzyme Inhibition Constant Data from BindingDB
Found 3 hits for monomerid = 50052250
TargetL-lactate dehydrogenase B chain(Homo sapiens (Human))
Genentech
Curated by ChEMBL
LigandPNGBDBM50052250(CHEMBL3318465)
Affinity DataIC50:  1.30E+4nM. Assay description: Inhibition of human recombinant carboxy-terminal His-tagged LDHB by UV endpoint assay
In DepthDetails ArticlePubMed
TargetL-lactate dehydrogenase A chain(Homo sapiens (Human))
Genentech
Curated by ChEMBL
LigandPNGBDBM50052250(CHEMBL3318465)
Affinity DataIC50: >1.00E+5nM. Assay description: Inhibition of human recombinant carboxy-terminal His-tagged LDHA by UV endpoint assay
In DepthDetails ArticlePubMed
TargetL-lactate dehydrogenase A chain(Homo sapiens (Human))
Genentech
Curated by ChEMBL
LigandPNGBDBM50052250(CHEMBL3318465)
Affinity DataKd:  8.20E+3nM. Assay description: Inhibition of human recombinant carboxy-terminal His-tagged LDHA by SPR assay
In DepthDetails ArticlePubMed