BDBM50052277 (2S,3S)-3-(3,5-Bis-trifluoromethyl-benzyloxy)-1-furan-2-ylmethyl-2-phenyl-piperidine::CHEMBL100141
SMILES FC(F)(F)c1cc(CO[C@H]2CCCN(Cc3ccco3)[C@H]2c2ccccc2)cc(c1)C(F)(F)F
InChI Key InChIKey=IEYWODZRHHRXAA-GOTSBHOMSA-N
Data  2 IC50
  Tab Delimited (TSV)   2D SDfile   Computed 3D by Vconf -m prep SDfile
Find this compound or compounds like it in BindingDB:
Activity Spreadsheet -- Enzyme Inhibition Constant Data from BindingDB
Found 2 hits for monomerid = 50052277
TargetSubstance-P receptor(Homo sapiens (Human))
Washington University
Curated by ChEMBL
LigandPNGBDBM50052277((2S,3S)-3-(3,5-Bis-trifluoromethyl-benzyloxy)-1-fu...)
Affinity DataIC50:  39.8nM. Assay description: Binding affinity was measured against the Tachykinin receptor 1 in CHO-expressed hNK1 using [125I]SP.
In DepthDetails ArticlePubMed
TargetSubstance-P receptor(Homo sapiens (Human))
Washington University
Curated by ChEMBL
LigandPNGBDBM50052277((2S,3S)-3-(3,5-Bis-trifluoromethyl-benzyloxy)-1-fu...)
Affinity DataIC50:  36nM. Assay description: Displacement of [125 I]-Tyr8 SP from the cloned human Tachykinin receptor 1 expressed in CHO cells
In DepthDetails ArticlePubMed