BDBM50052278 5-[(2S,3S)-3-(3,5-Bis-trifluoromethyl-benzyloxy)-2-phenyl-piperidin-1-ylmethyl]-2,4-dihydro-[1,2,4]triazol-3-one::CHEMBL99055::L-741671
SMILES FC(F)(F)c1cc(CO[C@H]2CCCN(Cc3n[nH]c(=O)[nH]3)[C@H]2c2ccccc2)cc(c1)C(F)(F)F
InChI Key InChIKey=ZUWHBRRBKKTMQO-ICSRJNTNSA-N
Data  3 IC50
  Tab Delimited (TSV)   2D SDfile   Computed 3D by Vconf -m prep SDfile
Find this compound or compounds like it in BindingDB:
Activity Spreadsheet -- Enzyme Inhibition Constant Data from BindingDB
Found 3 hits for monomerid = 50052278
TargetSubstance-P receptor(Homo sapiens (Human))
Merck Sharp And Dohme Research Laboratories
Curated by ChEMBL
LigandPNGBDBM50052278(5-[(2S,3S)-3-(3,5-Bis-trifluoromethyl-benzyloxy)-2...)
Affinity DataIC50:  0.0500nM. Assay description: Displacement of [125 I]-Tyr8 SP from the cloned human Tachykinin receptor 1 expressed in CHO cells
In DepthDetails ArticlePubMed
TargetSubstance-P receptor(Homo sapiens (Human))
Merck Sharp And Dohme Research Laboratories
Curated by ChEMBL
LigandPNGBDBM50052278(5-[(2S,3S)-3-(3,5-Bis-trifluoromethyl-benzyloxy)-2...)
Affinity DataIC50:  0.100nM. Assay description: Binding affinity was measured against the Tachykinin receptor 1 in CHO-expressed hNK1 using [125I]SP.
In DepthDetails ArticlePubMed
TargetSubstance-P receptor(Homo sapiens (Human))
Merck Sharp And Dohme Research Laboratories
Curated by ChEMBL
LigandPNGBDBM50052278(5-[(2S,3S)-3-(3,5-Bis-trifluoromethyl-benzyloxy)-2...)
Affinity DataIC50:  0.0500nM. Assay description: Inhibition of substance P binding to Tachykinin receptor 1 in Chinese hamster ovary cells
In DepthDetails ArticlePubMed