BDBM50052297 CHEMBL3318525
SMILES Nc1nnc(SC2=C(O)CC(CC2=O)c2ccccc2)s1
InChI Key InChIKey=OSFOLFBIKUYETL-UHFFFAOYSA-N
Data  1 IC50
  Tab Delimited (TSV)   2D SDfile   Computed 3D by Vconf -m prep SDfile
Find this compound or compounds like it in BindingDB:
Activity Spreadsheet -- Enzyme Inhibition Constant Data from BindingDB
Found 1 hit for monomerid = 50052297
TargetL-lactate dehydrogenase A chain(Homo sapiens (Human))
Genentech
Curated by ChEMBL
LigandPNGBDBM50052297(CHEMBL3318525)
Affinity DataIC50:  1.00E+3nM. Assay description: Inhibition of human recombinant carboxy-terminal His-tagged LDHA by UV endpoint assay
In DepthDetails ArticlePubMed