BDBM50052299 CHEMBL3318526
SMILES CSc1nnc(SC2=C(O)CC(CC2=O)c2ccccc2)s1
InChI Key InChIKey=HUHJNCOYUMWKFP-UHFFFAOYSA-N
Data  1 IC50
  Tab Delimited (TSV)   2D SDfile   Computed 3D by Vconf -m prep SDfile
Find this compound or compounds like it in BindingDB:
Activity Spreadsheet -- Enzyme Inhibition Constant Data from BindingDB
Found 1 hit for monomerid = 50052299
TargetL-lactate dehydrogenase A chain(Homo sapiens (Human))
Genentech
Curated by ChEMBL
LigandPNGBDBM50052299(CHEMBL3318526)
Affinity DataIC50:  7.40E+3nM. Assay description: Inhibition of human recombinant carboxy-terminal His-tagged LDHA by UV endpoint assay
In DepthDetails ArticlePubMed