BDBM50052328 13-benzyl-6-hydroxy-15-isopropenyl-4,17-dimethyl-5-oxo-(1R,2S,6R,10S,11R,15R,17R)-12,14,18-trioxapentacyclo[11.4.1.01,10.02,6.011,15]octadeca-3,8-dien-8-ylmethyl 2-phenylacetate::CHEMBL319078
SMILES C[C@@H]1C[C@]2(OC3(Cc4ccccc4)OC2[C@@H]2C=C(COC(=O)Cc4ccccc4)C[C@@]4(O)[C@@H](C=C(C)C4=O)C12O3)C(C)=C
InChI Key InChIKey=HOJGICDKYYLHKX-CBMQPHGMSA-N
Data  1 KI
  Tab Delimited (TSV)   2D SDfile   Computed 3D by Vconf -m prep SDfile
Find this compound or compounds like it in BindingDB:
Activity Spreadsheet -- Enzyme Inhibition Constant Data from BindingDB
Found 1 hit for monomerid = 50052328
TargetTransient receptor potential cation channel subfamily V member 1(Rattus norvegicus (rat))
Institute For Medical Research
Curated by ChEMBL
LigandPNGBDBM50052328(13-benzyl-6-hydroxy-15-isopropenyl-4,17-dimethyl-5...)
Affinity DataKi:  8.30nM. Assay description: Binding affinity against Vanilloid receptor in dorsal Root Ganglion (DRG) membranes using [3H]RTX binding assay.
In DepthDetails ArticlePubMed