BDBM50052330 13-benzyl-5,6-dihydroxy-15-isopropenyl-4,17-dimethyl-(1R,2S,5S,6R,10S,11R,15R,17R)-12,14,18-trioxapentacyclo[11.4.1.01,10.02,6.011,15]octadeca-3,8-dien-8-ylmethyl 2-(4-hydroxy-3-methoxyphenyl)acetate::CHEMBL97880
SMILES COc1cc(CC(=O)NCC2=C[C@H]3C4OC5(Cc6ccccc6)O[C@@]4(C[C@@H](C)C3(O5)[C@@H]3C=C(C)C(=O)[C@@]3(O)C2)C(C)=C)ccc1O
InChI Key InChIKey=OUYWDURTMMHBNW-XSOHGINVSA-N
Data  1 KI
  Tab Delimited (TSV)   2D SDfile   Computed 3D by Vconf -m prep SDfile
Find this compound or compounds like it in BindingDB:
Activity Spreadsheet -- Enzyme Inhibition Constant Data from BindingDB
Found 1 hit for monomerid = 50052330
TargetTransient receptor potential cation channel subfamily V member 1(Rattus norvegicus (rat))
Institute For Medical Research
Curated by ChEMBL
LigandPNGBDBM50052330(13-benzyl-5,6-dihydroxy-15-isopropenyl-4,17-dimeth...)
Affinity DataKi:  11nM. Assay description: Binding affinity against Vanilloid receptor in dorsal Root Ganglion (DRG) membranes using [3H]RTX binding assay.
In DepthDetails ArticlePubMed