BDBM50052498 CHEMBL3318432
SMILES OC1=C(Sc2cccc(c2)C(F)(F)F)C(=O)CC(C1)c1ccccc1
InChI Key InChIKey=SBABYZUMYQLIQA-UHFFFAOYSA-N
Data  1 IC50
  Tab Delimited (TSV)   2D SDfile   Computed 3D by Vconf -m prep SDfile
Find this compound or compounds like it in BindingDB:
Activity Spreadsheet -- Enzyme Inhibition Constant Data from BindingDB
Found 1 hit for monomerid = 50052498
TargetL-lactate dehydrogenase A chain(Homo sapiens (Human))
Genentech
Curated by ChEMBL
LigandPNGBDBM50052498(CHEMBL3318432)
Affinity DataIC50: >1.00E+5nM. Assay description: Inhibition of human recombinant carboxy-terminal His-tagged LDHA by UV endpoint assay
In DepthDetails ArticlePubMed