BDBM50052544 3-[4-(4-Thiophen-2-yl-3,6-dihydro-2H-pyridin-1-yl)-but-1-ynyl]-pyridine::CHEMBL108462
SMILES C(CN1CCC(=CC1)c1cccs1)C#Cc1cccnc1
InChI Key InChIKey=JLTOBYGAYFPXPN-UHFFFAOYSA-N
Data  1 KI
  Tab Delimited (TSV)   2D SDfile   Computed 3D by Vconf -m prep SDfile
Find this compound or compounds like it in BindingDB:
Activity Spreadsheet -- Enzyme Inhibition Constant Data from BindingDB
Found 1 hit for monomerid = 50052544
TargetD(2) dopamine receptor(Rattus norvegicus (rat))
Warner-Lambert
Curated by ChEMBL
LigandPNGBDBM50052544(3-[4-(4-Thiophen-2-yl-3,6-dihydro-2H-pyridin-1-yl)...)
Affinity DataKi:  255nM. Assay description: Binding affinity at Dopamine receptor D2 in rat striatal membrane by [3H]-spiperone displacement.
In DepthDetails ArticlePubMed