BDBM50052702 2-(4-Aminophenyl)benzothiazole::4-Benzothiazol-2-yl-phenylamine::CHEMBL93118
SMILES Nc1ccc(cc1)-c1nc2ccccc2s1
InChI Key InChIKey=WKRCOZSCENDENK-UHFFFAOYSA-N
Data  1 KI  4 IC50
  Tab Delimited (TSV)   2D SDfile   Computed 3D by Vconf -m prep SDfile
Find this compound or compounds like it in BindingDB:
Activity Spreadsheet -- Enzyme Inhibition Constant Data from BindingDB
Found 5 hits for monomerid = 50052702
TargetAmyloid-beta precursor protein(Homo sapiens (Human))
University Of Pittsburgh
Curated by ChEMBL
LigandPNGBDBM50052702(2-(4-Aminophenyl)benzothiazole | 4-Benzothiazol-2-...)
Affinity DataKi:  37nM. Assay description: Binding affinity for Amyloid beta 1-40 aggregates in competition with [N-methyl-3H] BTA-1.
In DepthDetails ArticlePubMed
TargetCollagenase 3(Homo sapiens (Human))
"A. Moro" University Of Bari
Curated by ChEMBL
LigandPNGBDBM50052702(2-(4-Aminophenyl)benzothiazole | 4-Benzothiazol-2-...)
Affinity DataIC50: >1.00E+5nM. Assay description: Inhibition of recombinant human MMP13 catalytic domain (Tyr104 to Asn274 residues) expressed in Escherichia coli cells using Mca-Pro-Leu-Gly-Leu-Dpa-...
In DepthDetails ArticlePubMed
TargetMatrix metalloproteinase-9(Homo sapiens (Human))
"A. Moro" University Of Bari
Curated by ChEMBL
LigandPNGBDBM50052702(2-(4-Aminophenyl)benzothiazole | 4-Benzothiazol-2-...)
Affinity DataIC50:  7.90E+4nM. Assay description: Inhibition of recombinant human MMP9 catalytic domain (Phe107 to Pro449 residues) expressed in Escherichia coli cells using Mca-Pro-Leu-Gly-Leu-Dpa-A...
In DepthDetails ArticlePubMed
Target72 kDa type IV collagenase(Homo sapiens (Human))
"A. Moro" University Of Bari
Curated by ChEMBL
LigandPNGBDBM50052702(2-(4-Aminophenyl)benzothiazole | 4-Benzothiazol-2-...)
Affinity DataIC50: >1.00E+5nM. Assay description: Inhibition of recombinant human MMP2 catalytic domain (Tyr110 to Asp452 residues) expressed in yeast cells using Mca-Pro-Leu-Gly-Leu-Dpa-Ala-Arg-NH2/...
In DepthDetails ArticlePubMed
TargetNeutrophil collagenase(Homo sapiens (Human))
"A. Moro" University Of Bari
Curated by ChEMBL
LigandPNGBDBM50052702(2-(4-Aminophenyl)benzothiazole | 4-Benzothiazol-2-...)
Affinity DataIC50:  8.80E+4nM. Assay description: Inhibition of recombinant human MMP8 catalytic domain (Phe99 to Gln269 residues) expressed in Escherichia coli cells using Mca-Pro-Leu-Gly-Leu-Dpa-Al...
In DepthDetails ArticlePubMed