BDBM50052733 8-Chloro-3-[2-(4-dimethylamino-phenyl)-ethyl]-5-phenyl-2,3,4,5-tetrahydro-1H-benzo[d]azepin-7-ol::CHEMBL114726
SMILES CN(C)c1ccc(CCN2CCc3cc(Cl)c(O)cc3C(C2)c2ccccc2)cc1
InChI Key InChIKey=HNNOJBGMULILCR-UHFFFAOYSA-N
Data  1 KI
  Tab Delimited (TSV)   2D SDfile   Computed 3D by Vconf -m prep SDfile
Find this compound or compounds like it in BindingDB:
Activity Spreadsheet -- Enzyme Inhibition Constant Data from BindingDB
Found 1 hit for monomerid = 50052733
TargetD(1A) dopamine receptor(RAT)
National Institutes Of Health
Curated by ChEMBL
LigandPNGBDBM50052733(8-Chloro-3-[2-(4-dimethylamino-phenyl)-ethyl]-5-ph...)
Affinity DataKi:  88.4nM. Assay description: Affinity for Dopamine receptor D1 binding measured by competition against [3H]-SCH- 23390 to rat striatal membrane
In DepthDetails ArticlePubMed