BDBM50052786 CHEMBL3318610
SMILES COC(=O)c1cnn(c1)C(=O)N1CCN(Cc2ccc3ccccc3c2)CC1
InChI Key InChIKey=HZJUKWAPMUWQBZ-UHFFFAOYSA-N
Data  1 KI
  Tab Delimited (TSV)   2D SDfile   Computed 3D by Vconf -m prep SDfile
Find this compound or compounds like it in BindingDB:
Activity Spreadsheet -- Enzyme Inhibition Constant Data from BindingDB
Found 1 hit for monomerid = 50052786
TargetFatty-acid amide hydrolase 1 [30-579](Rattus norvegicus (rat))
The Scripps Research Institute
Curated by ChEMBL
LigandPNGBDBM50052786(CHEMBL3318610)
Affinity DataKi:  0.360nM. Assay description: Irreversible inhibition of recombinant rat FAAH preincubated for 3 hrs
In DepthDetails ArticlePubMed