BDBM50052803 CHEMBL591503
SMILES [H][C@@]12O[C@@H](C(=O)N3CCN(CCO)CC3)[C@@]([H])(O1)C(=O)N(Cc1ccccc1)[C@H]2Cc1ccccc1
InChI Key InChIKey=VCNZRFQBGNZKPN-NZCWTCFWSA-N
Data  1 IC50
  Tab Delimited (TSV)   2D SDfile   Computed 3D by Vconf -m prep SDfile
Find this compound or compounds like it in BindingDB:
Activity Spreadsheet -- Enzyme Inhibition Constant Data from BindingDB
Found 1 hit for monomerid = 50052803
TargetProtease(Human immunodeficiency virus 1 (HIV-1))
University Of Florence
Curated by ChEMBL
LigandPNGBDBM50052803(CHEMBL591503)
Affinity DataIC50:  5.60E+3nM. Assay description: Inhibition of HIV-1 protease using DABCYL-Abu-Ser-Gln-Asn-Tyr-Pro-Ile-Val-Gln-EDANS as substrate preincubated for 15 mins before substrate addition m...
In DepthDetails ArticlePubMed