BDBM50052836 CHEMBL3318750
SMILES Oc1ccc(\C=N\NC(=O)CCC(=O)N\N=C\c2ccc(O)c(O)c2O)c(O)c1O
InChI Key InChIKey=ZSSNJJPFDCSVRK-OKXCLTPOSA-N
Data  1 IC50
  Tab Delimited (TSV)   2D SDfile   Computed 3D by Vconf -m prep SDfile
Find this compound or compounds like it in BindingDB:
Activity Spreadsheet -- Enzyme Inhibition Constant Data from BindingDB
Found 1 hit for monomerid = 50052836
TargetPoly(ADP-ribose) glycohydrolase(Rattus norvegicus)
Kumamoto Health Science University
Curated by ChEMBL
LigandPNGBDBM50052836(CHEMBL3318750)
Affinity DataIC50:  9.80E+3nM. Assay description: Inhibition of rat testis GST-tagged PARG catalytic activity after 30 mins using [32P]poly(ADP-ribose) by radioassay
In DepthDetails ArticlePubMed