BDBM50052855 (R)-11-Methoxy-10-methyl-5,6,6a,7-tetrahydro-4H-dibenzo[de,g]quinoline::CHEMBL117730
SMILES COc1c(C)ccc2C[C@H]3NCCc4cccc(c34)-c12
InChI Key InChIKey=PTLXBYXMMYOTFF-OAHLLOKOSA-N
Data  3 KI
  Tab Delimited (TSV)   2D SDfile   Computed 3D by Vconf -m prep SDfile
Find this compound or compounds like it in BindingDB:
Activity Spreadsheet -- Enzyme Inhibition Constant Data from BindingDB
Found 3 hits for monomerid = 50052855
Target5-hydroxytryptamine receptor 1A(Rattus norvegicus (rat))
Uppsala University
Curated by ChEMBL
LigandPNGBDBM50052855((R)-11-Methoxy-10-methyl-5,6,6a,7-tetrahydro-4H-di...)
Affinity DataKi:  12.6nM. Assay description: In vitro affinity at 5-hydroxytryptamine 1A receptor of rat hippocampus by [3H]-8-OH-DPAT displacement.
In DepthDetails ArticlePubMed
TargetD(2) dopamine receptor(Homo sapiens (Human))
Uppsala University
Curated by ChEMBL
LigandPNGBDBM50052855((R)-11-Methoxy-10-methyl-5,6,6a,7-tetrahydro-4H-di...)
Affinity DataKi:  4.71E+3nM. Assay description: In vitro affinity at human cloned Dopamine receptor D2A by [3H]-raclopride displacement.
In DepthDetails ArticlePubMed
TargetD(1A) dopamine receptor(RAT)
Uppsala University
Curated by ChEMBL
LigandPNGBDBM50052855((R)-11-Methoxy-10-methyl-5,6,6a,7-tetrahydro-4H-di...)
Affinity DataKi: >5.00E+3nM. Assay description: In vitro affinity at Dopamine receptor D1 of rat striatum by [3H]-SCH-23,390 displacement.
In DepthDetails ArticlePubMed