BDBM50052906 CHEMBL118805::N-[4-(5-Dimethylamino-2,3,4,5-tetrahydro-benzo[b]azepine-1-carbonyl)-phenyl]-2,N-dimethyl-benzamide
SMILES CN(C)C1CCCN(C(=O)c2ccc(cc2)N(C)C(=O)c2ccccc2C)c2ccccc12
InChI Key InChIKey=OOPNPCJITFJIQZ-UHFFFAOYSA-N
Data  2 IC50
  Tab Delimited (TSV)   2D SDfile   Computed 3D by Vconf -m prep SDfile
Find this compound or compounds like it in BindingDB:
Activity Spreadsheet -- Enzyme Inhibition Constant Data from BindingDB
Found 2 hits for monomerid = 50052906
TargetVasopressin V2 receptor(Rattus norvegicus (Rat))
Otsuka Pharmaceutical
Curated by ChEMBL
LigandPNGBDBM50052906(CHEMBL118805 | N-[4-(5-Dimethylamino-2,3,4,5-tetra...)
Affinity DataIC50:  1.00E+3nM. Assay description: Displacement of [3H]-AVP from its AVP-V2 receptor binding site in rat kidney
In DepthDetails ArticlePubMed
TargetVasopressin V1a receptor(RAT)
Otsuka Pharmaceutical
Curated by ChEMBL
LigandPNGBDBM50052906(CHEMBL118805 | N-[4-(5-Dimethylamino-2,3,4,5-tetra...)
Affinity DataIC50:  1.90E+4nM. Assay description: Displacement of [3H]-AVP from AVP-V1a receptor binding site in rat liver
In DepthDetails ArticlePubMed