BDBM50052921 1-Phenyl-3-[4-(2,3,4,5-tetrahydro-benzo[b]azepine-1-carbonyl)-phenyl]-urea::CHEMBL332450
SMILES O=C(Nc1ccccc1)Nc1ccc(cc1)C(=O)N1CCCCc2ccccc12
InChI Key InChIKey=MVBKZZBVTHGBIE-UHFFFAOYSA-N
Data  2 IC50
  Tab Delimited (TSV)   2D SDfile   Computed 3D by Vconf -m prep SDfile
Find this compound or compounds like it in BindingDB:
Activity Spreadsheet -- Enzyme Inhibition Constant Data from BindingDB
Found 2 hits for monomerid = 50052921
TargetVasopressin V1a receptor(RAT)
Otsuka Pharmaceutical
Curated by ChEMBL
LigandPNGBDBM50052921(1-Phenyl-3-[4-(2,3,4,5-tetrahydro-benzo[b]azepine-...)
Affinity DataIC50:  760nM. Assay description: Displacement of [3H]-AVP from AVP-V1a receptor binding site in rat liver
In DepthDetails ArticlePubMed
TargetVasopressin V2 receptor(Rattus norvegicus (Rat))
Otsuka Pharmaceutical
Curated by ChEMBL
LigandPNGBDBM50052921(1-Phenyl-3-[4-(2,3,4,5-tetrahydro-benzo[b]azepine-...)
Affinity DataIC50:  180nM. Assay description: Displacement of [3H]-AVP from its AVP-V2 receptor binding site in rat kidney
In DepthDetails ArticlePubMed