BDBM50052943 CHEMBL119291::N-[2-(3,4-Dihydro-2H-quinoline-1-carbonyl)-phenyl]-benzamide
SMILES O=C(Nc1ccccc1C(=O)N1CCCc2ccccc12)c1ccccc1
InChI Key InChIKey=WYWLAPJAYRXGOC-UHFFFAOYSA-N
Data  2 IC50
  Tab Delimited (TSV)   2D SDfile   Computed 3D by Vconf -m prep SDfile
Find this compound or compounds like it in BindingDB:
Activity Spreadsheet -- Enzyme Inhibition Constant Data from BindingDB
Found 2 hits for monomerid = 50052943
TargetVasopressin V1a receptor(RAT)
Otsuka Pharmaceutical
Curated by ChEMBL
LigandPNGBDBM50052943(CHEMBL119291 | N-[2-(3,4-Dihydro-2H-quinoline-1-ca...)
Affinity DataIC50:  8.80E+4nM. Assay description: Displacement of [3H]-AVP from AVP-V1a receptor binding site in rat liver
In DepthDetails ArticlePubMed
TargetVasopressin V2 receptor(Rattus norvegicus (Rat))
Otsuka Pharmaceutical
Curated by ChEMBL
LigandPNGBDBM50052943(CHEMBL119291 | N-[2-(3,4-Dihydro-2H-quinoline-1-ca...)
Affinity DataIC50:  2.20E+4nM. Assay description: Displacement of [3H]-AVP from its AVP-V2 receptor binding site in rat kidney
In DepthDetails ArticlePubMed