BDBM50052952 CHEMBL324935::N-[4-(3,4-Dihydro-2H-quinoline-1-carbonyl)-phenyl]-isobutyramide
SMILES CC(C)C(=O)Nc1ccc(cc1)C(=O)N1CCCc2ccccc12
InChI Key InChIKey=GSJBILDUFGGDEH-UHFFFAOYSA-N
Data  2 IC50
  Tab Delimited (TSV)   2D SDfile   Computed 3D by Vconf -m prep SDfile
Find this compound or compounds like it in BindingDB:
Activity Spreadsheet -- Enzyme Inhibition Constant Data from BindingDB
Found 2 hits for monomerid = 50052952
TargetVasopressin V2 receptor(Rattus norvegicus (Rat))
Otsuka Pharmaceutical
Curated by ChEMBL
LigandPNGBDBM50052952(CHEMBL324935 | N-[4-(3,4-Dihydro-2H-quinoline-1-ca...)
Affinity DataIC50:  8.10E+3nM. Assay description: Displacement of [3H]-AVP from its AVP-V2 receptor binding site in rat kidney
In DepthDetails ArticlePubMed
TargetVasopressin V1a receptor(RAT)
Otsuka Pharmaceutical
Curated by ChEMBL
LigandPNGBDBM50052952(CHEMBL324935 | N-[4-(3,4-Dihydro-2H-quinoline-1-ca...)
Affinity DataIC50:  2.40E+3nM. Assay description: Displacement of [3H]-AVP from AVP-V1a receptor binding site in rat liver
In DepthDetails ArticlePubMed