BDBM50053090 (2S,3S,4R)-4-(1-Biphenyl-3-yl-vinyl)-3-carboxymethyl-pyrrolidine-2-carboxylic acid::CHEMBL121510
SMILES OC(=O)C[C@H]1[C@@H](CN[C@@H]1C(O)=O)C(=C)c1cccc(c1)-c1ccccc1
InChI Key InChIKey=IMXVNEJUSJQSBB-BJLQDIEVSA-N
Data  1 KI
  Tab Delimited (TSV)   2D SDfile   Computed 3D by Vconf -m prep SDfile
Find this compound or compounds like it in BindingDB:
Activity Spreadsheet -- Enzyme Inhibition Constant Data from BindingDB
Found 1 hit for monomerid = 50053090
TargetGlutamate receptor ionotropic, kainate 2(Homo sapiens (Human))
Eli Lilly
Curated by ChEMBL
LigandPNGBDBM50053090((2S,3S,4R)-4-(1-Biphenyl-3-yl-vinyl)-3-carboxymeth...)
Affinity DataKi:  3.11E+3nM. Assay description: Inhibition of [3H]-kainate binding at ionotropic glutamate receptor kainate 2
In DepthDetails ArticlePubMed