BDBM50053193 1-[2-({2-[5-Chloro-1-(4-fluoro-phenyl)-1H-indol-3-yloxy]-ethyl}-methyl-amino)-ethyl]-imidazolidin-2-one::CHEMBL421244
SMILES CN(CCOc1cn(-c2ccc(F)cc2)c2ccc(Cl)cc12)CCN1CCNC1=O
InChI Key InChIKey=HGIVBBHIACENDG-UHFFFAOYSA-N
Data  3 IC50
  Tab Delimited (TSV)   2D SDfile   Computed 3D by Vconf -m prep SDfile
Find this compound or compounds like it in BindingDB:
Activity Spreadsheet -- Enzyme Inhibition Constant Data from BindingDB
Found 3 hits for monomerid = 50053193
TargetAlpha-1A adrenergic receptor(Rattus norvegicus (Rat))
H. Lundbeck
Curated by ChEMBL
LigandPNGBDBM50053193(1-[2-({2-[5-Chloro-1-(4-fluoro-phenyl)-1H-indol-3-...)
Affinity DataIC50:  5.70nM. Assay description: Binding affinity to the alpha-1 adrenergic receptor using a radioligand [3H]-prazosin binding assay in rat brain membranes
In DepthDetails ArticlePubMed
Target5-hydroxytryptamine receptor 2A(Rattus norvegicus (rat))
H. Lundbeck
Curated by ChEMBL
LigandPNGBDBM50053193(1-[2-({2-[5-Chloro-1-(4-fluoro-phenyl)-1H-indol-3-...)
Affinity DataIC50:  0.880nM. Assay description: Binding affinity to serotonin 5-hydroxytryptamine 2A receptors using a radioligand [3H]-ketanserin binding assay in rat cortical membranes
In DepthDetails ArticlePubMed
TargetD(2) dopamine receptor(Rattus norvegicus (rat))
H. Lundbeck
Curated by ChEMBL
LigandPNGBDBM50053193(1-[2-({2-[5-Chloro-1-(4-fluoro-phenyl)-1H-indol-3-...)
Affinity DataIC50:  5.80nM. Assay description: Binding affinity to dopamine receptor D2 using a [3H]-spiperone binding assay in rat cortical membranes
In DepthDetails ArticlePubMed