BDBM50053198 5-Chloro-1-(4-fluoro-phenyl)-3-(2-piperidin-1-yl-ethoxy)-1H-indole::CHEMBL125291
SMILES Fc1ccc(cc1)-n1cc(OCCN2CCCCC2)c2cc(Cl)ccc12
InChI Key InChIKey=GAOSWGAJUGKDAT-UHFFFAOYSA-N
Data  3 IC50
  Tab Delimited (TSV)   2D SDfile   Computed 3D by Vconf -m prep SDfile
Find this compound or compounds like it in BindingDB:
Activity Spreadsheet -- Enzyme Inhibition Constant Data from BindingDB
Found 3 hits for monomerid = 50053198
TargetD(2) dopamine receptor(Rattus norvegicus (rat))
H. Lundbeck
Curated by ChEMBL
LigandPNGBDBM50053198(5-Chloro-1-(4-fluoro-phenyl)-3-(2-piperidin-1-yl-e...)
Affinity DataIC50:  2.30nM. Assay description: Binding affinity to dopamine receptor D2 using a [3H]-spiperone binding assay in rat cortical membranes
In DepthDetails ArticlePubMed
Target5-hydroxytryptamine receptor 2A(Rattus norvegicus (rat))
H. Lundbeck
Curated by ChEMBL
LigandPNGBDBM50053198(5-Chloro-1-(4-fluoro-phenyl)-3-(2-piperidin-1-yl-e...)
Affinity DataIC50:  5.90nM. Assay description: Binding affinity to serotonin 5-hydroxytryptamine 2A receptors using a radioligand [3H]-ketanserin binding assay in rat cortical membranes
In DepthDetails ArticlePubMed
TargetAlpha-1A adrenergic receptor(Rattus norvegicus (Rat))
H. Lundbeck
Curated by ChEMBL
LigandPNGBDBM50053198(5-Chloro-1-(4-fluoro-phenyl)-3-(2-piperidin-1-yl-e...)
Affinity DataIC50:  32nM. Assay description: Binding affinity to the alpha-1 adrenergic receptor using a radioligand [3H]-prazosin binding assay in rat brain membranes
In DepthDetails ArticlePubMed