BDBM50053347 CHEMBL3330275
SMILES CCc1cccc(CC)c1CNC(=O)c1ccc2[nH]nc(-c3cccc(c3)S(N)(=O)=O)c2c1
InChI Key InChIKey=REHCYJGTZODHAE-UHFFFAOYSA-N
Data  1 IC50
  Tab Delimited (TSV)   2D SDfile   Computed 3D by Vconf -m prep SDfile
Find this compound or compounds like it in BindingDB:
Activity Spreadsheet -- Enzyme Inhibition Constant Data from BindingDB
Found 1 hit for monomerid = 50053347
TargetDual specificity protein kinase TTK(Homo sapiens (Human))
University Health Network
Curated by ChEMBL
LigandPNGBDBM50053347(CHEMBL3330275)
Affinity DataIC50:  80nM. Assay description: Inhibition of SUMO-tagged human TTK (1-275 residues) compound pre-incubated for 15 mins prior ATP addition by MBP-based assay
In DepthDetails ArticlePubMed