BDBM50053362 CHEMBL3330281
SMILES NS(=O)(=O)c1cccc(c1)-c1n[nH]c2ccc(cc12)C(=O)NC(C1CC1)c1ccccc1
InChI Key
Data  2 IC50
  Tab Delimited (TSV)   2D SDfile   Computed 3D by Vconf -m prep SDfile
Find this compound or compounds like it in BindingDB:
Activity Spreadsheet -- Enzyme Inhibition Constant Data from BindingDB
Found 2 hits for monomerid = 50053362
TargetDual specificity protein kinase TTK(Homo sapiens (Human))
Entremed
Curated by ChEMBL
LigandPNGBDBM50053362(CHEMBL3330281)
Affinity DataIC50:  16nM. Assay description: Inhibition of amino terminal GST-fused full length human TTK using His6-SUMO-TTK-N as substrate preincubated for 15 mins prior to ATP addition by ind...
In DepthDetails ArticlePubMed
TargetDual specificity protein kinase TTK(Homo sapiens (Human))
Entremed
Curated by ChEMBL
LigandPNGBDBM50053362(CHEMBL3330281)
Affinity DataIC50:  16nM. Assay description: Inhibition of SUMO-tagged human TTK (1-275 residues) compound pre-incubated for 15 mins prior ATP addition by MBP-based assay
In DepthDetails ArticlePubMed