BDBM50053440 CHEMBL3323056
SMILES CCN(CC)CCCOc1ccc2nc3CCCn3c(=O)c2c1
InChI Key InChIKey=DWOXBDXTFVOWJF-UHFFFAOYSA-N
Data  6 IC50
  Tab Delimited (TSV)   2D SDfile   Computed 3D by Vconf -m prep SDfile
Find this compound or compounds like it in BindingDB:
Activity Spreadsheet -- Enzyme Inhibition Constant Data from BindingDB
Found 6 hits for monomerid = 50053440
TargetAcetylcholinesterase(Homo sapiens (Human))
Universit£T Regensburg
Curated by ChEMBL
LigandPNGBDBM50053440(CHEMBL3323056)
Affinity DataIC50:  1.25E+3nM. Assay description: Inhibition of human AChE
In DepthDetails ArticlePubMed
TargetAcetylcholinesterase(Homo sapiens (Human))
Universit£T Regensburg
Curated by ChEMBL
LigandPNGBDBM50053440(CHEMBL3323056)
Affinity DataIC50:  1.20E+3nM. Assay description: Inhibition of human AChE
In DepthDetails ArticlePubMed
TargetCholinesterase(Equus caballus (Horse))
Universit£T Regensburg
Curated by ChEMBL
LigandPNGBDBM50053440(CHEMBL3323056)
Affinity DataIC50:  828nM. Assay description: Inhibition of equine serum BChE
In DepthDetails ArticlePubMed
TargetAcetylcholinesterase(Electrophorus electricus (Electric eel))
Universit£T Regensburg
Curated by ChEMBL
LigandPNGBDBM50053440(CHEMBL3323056)
Affinity DataIC50:  101nM. Assay description: Inhibition of electric eel AChE
In DepthDetails ArticlePubMed
TargetCholinesterase(Equus caballus (Horse))
Universit£T Regensburg
Curated by ChEMBL
LigandPNGBDBM50053440(CHEMBL3323056)
Affinity DataIC50:  829nM. Assay description: Inhibition of equine serum BChE
In DepthDetails ArticlePubMed
TargetAcetylcholinesterase(Electrophorus electricus (Electric eel))
Universit£T Regensburg
Curated by ChEMBL
LigandPNGBDBM50053440(CHEMBL3323056)
Affinity DataIC50:  101nM. Assay description: Inhibition of electric eel AChE
In DepthDetails ArticlePubMed