BDBM50053441 CHEMBL3323053
SMILES O=c1n2CCCc2nc2ccc(OCCCN3CCCCC3)cc12
InChI Key InChIKey=FFIZZPFJAXHTDR-UHFFFAOYSA-N
Data  1 KI  9 IC50
  Tab Delimited (TSV)   2D SDfile   Computed 3D by Vconf -m prep SDfile
Find this compound or compounds like it in BindingDB:
Activity Spreadsheet -- Enzyme Inhibition Constant Data from BindingDB
Found 10 hits for monomerid = 50053441
TargetHistamine H3 receptor(Homo sapiens (Human))
Julius Maximilian University Of W£Rzburg
Curated by ChEMBL
LigandPNGBDBM50053441(CHEMBL3323053)
Affinity DataKi:  2.50E+3nM. Assay description: Inhibition of human histamine H3 receptor
In DepthDetails ArticlePubMed
TargetAcetylcholinesterase(Homo sapiens (Human))
Universit£T Regensburg
Curated by ChEMBL
LigandPNGBDBM50053441(CHEMBL3323053)
Affinity DataIC50:  1.10E+3nM. Assay description: Inhibition of human AChE
In DepthDetails ArticlePubMed
TargetAcetylcholinesterase(Electrophorus electricus (Electric eel))
Universit£T Regensburg
Curated by ChEMBL
LigandPNGBDBM50053441(CHEMBL3323053)
Affinity DataIC50:  69nM. Assay description: Inhibition of electric eel AChE
In DepthDetails ArticlePubMed
TargetAcetylcholinesterase(Electrophorus electricus (Electric eel))
Universit£T Regensburg
Curated by ChEMBL
LigandPNGBDBM50053441(CHEMBL3323053)
Affinity DataIC50:  69nM. Assay description: Inhibition of electric eel AChE
In DepthDetails ArticlePubMed
TargetAcetylcholinesterase(Homo sapiens (Human))
Universit£T Regensburg
Curated by ChEMBL
LigandPNGBDBM50053441(CHEMBL3323053)
Affinity DataIC50:  50nM. Assay description: Inhibition of human erythrocytes AChE using acetylthiocholine iodide as substrate preincubated for 4.5 mins followed by substrate addition measured a...
In DepthDetails ArticlePubMed
TargetCholinesterase(Equus caballus (Horse))
Universit£T Regensburg
Curated by ChEMBL
LigandPNGBDBM50053441(CHEMBL3323053)
Affinity DataIC50:  1.22E+5nM. Assay description: Inhibition of equine serum BChE
In DepthDetails ArticlePubMed
TargetCholinesterase(Equus caballus (Horse))
Universit£T Regensburg
Curated by ChEMBL
LigandPNGBDBM50053441(CHEMBL3323053)
Affinity DataIC50:  2.48E+5nM. Assay description: Inhibition of equine BChE
In DepthDetails ArticlePubMed
TargetAcetylcholinesterase(Homo sapiens (Human))
Universit£T Regensburg
Curated by ChEMBL
LigandPNGBDBM50053441(CHEMBL3323053)
Affinity DataIC50:  5.40E+3nM. Assay description: Inhibition of human AChE
In DepthDetails ArticlePubMed
TargetAcetylcholinesterase(Homo sapiens (Human))
Universit£T Regensburg
Curated by ChEMBL
LigandPNGBDBM50053441(CHEMBL3323053)
Affinity DataIC50:  1.08E+3nM. Assay description: Inhibition of human AChE
In DepthDetails ArticlePubMed
TargetCholinesterase(Equus caballus (Horse))
Universit£T Regensburg
Curated by ChEMBL
LigandPNGBDBM50053441(CHEMBL3323053)
Affinity DataIC50:  1.22E+5nM. Assay description: Inhibition of equine serum BChE
In DepthDetails ArticlePubMed