BDBM50053445 CHEMBL3323054
SMILES O=c1n2CCCc2nc2ccc(OCCCN3CCCCCC3)cc12
InChI Key InChIKey=LXPSFEADEMEYEK-UHFFFAOYSA-N
Data  4 IC50
  Tab Delimited (TSV)   2D SDfile   Computed 3D by Vconf -m prep SDfile
Find this compound or compounds like it in BindingDB:
Activity Spreadsheet -- Enzyme Inhibition Constant Data from BindingDB
Found 4 hits for monomerid = 50053445
TargetAcetylcholinesterase(Electrophorus electricus (Electric eel))
Universit£T Regensburg
Curated by ChEMBL
LigandPNGBDBM50053445(CHEMBL3323054)
Affinity DataIC50:  50nM. Assay description: Inhibition of electric eel AChE
In DepthDetails ArticlePubMed
TargetCholinesterase(Equus caballus (Horse))
Universit£T Regensburg
Curated by ChEMBL
LigandPNGBDBM50053445(CHEMBL3323054)
Affinity DataIC50:  5.22E+3nM. Assay description: Inhibition of equine serum BChE
In DepthDetails ArticlePubMed
TargetCholinesterase(Equus caballus (Horse))
Universit£T Regensburg
Curated by ChEMBL
LigandPNGBDBM50053445(CHEMBL3323054)
Affinity DataIC50:  5.22E+3nM. Assay description: Inhibition of equine serum BChE
In DepthDetails ArticlePubMed
TargetAcetylcholinesterase(Electrophorus electricus (Electric eel))
Universit£T Regensburg
Curated by ChEMBL
LigandPNGBDBM50053445(CHEMBL3323054)
Affinity DataIC50:  50nM. Assay description: Inhibition of electric eel AChE
In DepthDetails ArticlePubMed