BDBM50053546 4-[3-(7-Benzothiazol-2-yl-5-furan-3-yl-naphthalen-2-yloxymethyl)-phenyl]-tetrahydro-pyran-4-ol::CHEMBL128660
SMILES OC1(CCOCC1)c1cccc(COc2ccc3c(cc(cc3c2)-c2nc3ccccc3s2)-c2ccoc2)c1
InChI Key InChIKey=RBDJKKNFVTYRFK-UHFFFAOYSA-N
Data  1 IC50
  Tab Delimited (TSV)   2D SDfile   Computed 3D by Vconf -m prep SDfile
Find this compound or compounds like it in BindingDB:
Activity Spreadsheet -- Enzyme Inhibition Constant Data from BindingDB
Found 1 hit for monomerid = 50053546
TargetPolyunsaturated fatty acid 5-lipoxygenase(Homo sapiens (Human))
Merck Frosst Centre For Therapeutic Research
Curated by ChEMBL
LigandPNGBDBM50053546(4-[3-(7-Benzothiazol-2-yl-5-furan-3-yl-naphthalen-...)
Affinity DataIC50: >6.00E+3nM. Assay description: Potency to inhibit oxidation of arachidonic acid by recombinant human 5-lipoxygenase
In DepthDetails ArticlePubMed