BDBM50053563 7-[3-(4-Hydroxy-tetrahydro-pyran-4-yl)-benzyloxy]-4-(4-methoxy-phenyl)-3H-naphtho[2,3-c]furan-1-one::CHEMBL338489
SMILES COc1ccc(cc1)-c1c2COC(=O)c2cc2cc(OCc3cccc(c3)C3(O)CCOCC3)ccc12
InChI Key InChIKey=SNEDIJUSYIMLHJ-UHFFFAOYSA-N
Data  1 IC50
  Tab Delimited (TSV)   2D SDfile   Computed 3D by Vconf -m prep SDfile
Find this compound or compounds like it in BindingDB:
Activity Spreadsheet -- Enzyme Inhibition Constant Data from BindingDB
Found 1 hit for monomerid = 50053563
TargetPolyunsaturated fatty acid 5-lipoxygenase(Homo sapiens (Human))
Merck Frosst Centre For Therapeutic Research
Curated by ChEMBL
LigandPNGBDBM50053563(7-[3-(4-Hydroxy-tetrahydro-pyran-4-yl)-benzyloxy]-...)
Affinity DataIC50:  6.00E+3nM. Assay description: Potency to inhibit oxidation of arachidonic acid by recombinant human 5-lipoxygenase
In DepthDetails ArticlePubMed