BDBM50053573 CHEMBL3327220
SMILES N[C@@H](Cc1ccc(O)cc1)C(=O)N1C[C@@H]([C@H](C1)c1ccccc1)C(=O)N[C@@H](Cc1ccccc1)C(=O)N[C@@H](Cc1ccccc1)C(N)=O
InChI Key InChIKey=YGXYTRHKKXBBAH-OWIQAHIBSA-N
Data  3 IC50
  Tab Delimited (TSV)   2D SDfile   Computed 3D by Vconf -m prep SDfile
Find this compound or compounds like it in BindingDB:
Activity Spreadsheet -- Enzyme Inhibition Constant Data from BindingDB
Found 3 hits for monomerid = 50053573
TargetKappa-type opioid receptor(Cavia porcellus (domestic guinea pig))
Medical University Of Lodz
Curated by ChEMBL
LigandPNGBDBM50053573(CHEMBL3327220)
Affinity DataIC50:  27nM. Assay description: Displacement of [3H]nor-BNI from KOR in guinea pig brain membranes
In DepthDetails ArticlePubMed
TargetMu-type opioid receptor(Rattus norvegicus (rat))
Medical University Of Lodz
Curated by ChEMBL
LigandPNGBDBM50053573(CHEMBL3327220)
Affinity DataIC50:  0.850nM. Assay description: Displacement of [3H]DAMGO from MOR in rat brain membranes
In DepthDetails ArticlePubMed
TargetDelta-type opioid receptor(Rattus norvegicus (rat))
Medical University Of Lodz
Curated by ChEMBL
LigandPNGBDBM50053573(CHEMBL3327220)
Affinity DataIC50:  9.10nM. Assay description: Displacement of [3H](Ile5,6)deltorphin-2 from DOR in rat brain membranes
In DepthDetails ArticlePubMed