BDBM50053585 (S)-4-(amino(carboxy)methyl)-2-hydroxybenzoic acid::4-((S)-Amino-carboxy-methyl)-2-hydroxy-benzoic acid::4-[amino(carboxy)methyl]-2-hydroxybenzoic acid::CHEMBL39372
SMILES N[C@H](C(O)=O)c1ccc(C(O)=O)c(O)c1
InChI Key InChIKey=GXZSAQLJWLCLOX-ZETCQYMHSA-N
Data  3 IC50  2 EC50
  Tab Delimited (TSV)   2D SDfile   Computed 3D by Vconf -m prep SDfile
Find this compound or compounds like it in BindingDB:
Activity Spreadsheet -- Enzyme Inhibition Constant Data from BindingDB
Found 5 hits for monomerid = 50053585
TargetMetabotropic glutamate receptor 1(Homo sapiens (Human))
Università
Curated by ChEMBL
LigandPNGBDBM50053585((S)-4-(amino(carboxy)methyl)-2-hydroxybenzoic acid...)
Affinity DataIC50:  4.00E+4nM. Assay description: Inhibitory concentration of the compound for half maximal inhibition of PI hydrolysis (mGluR1a)
In DepthDetails ArticlePubMed
TargetMetabotropic glutamate receptor 1(RAT)
Parc Club Orsay Université
Curated by ChEMBL
LigandPNGBDBM50053585((S)-4-(amino(carboxy)methyl)-2-hydroxybenzoic acid...)
Affinity DataIC50:  4.00E+4nM. Assay description: Inhibitory activity of the compound against Metabotropic glutamate receptor 1 in the rat LLC-PK1/HEK 293 cells
In DepthDetails ArticlePubMed
TargetMetabotropic glutamate receptor 1(Homo sapiens (Human))
Università
Curated by ChEMBL
LigandPNGBDBM50053585((S)-4-(amino(carboxy)methyl)-2-hydroxybenzoic acid...)
Affinity DataIC50:  4.00E+4nM. Assay description: Antagonist activity at mGlu1 receptor
In DepthDetails ArticlePubMed
TargetMetabotropic glutamate receptor 2(Homo sapiens (Human))
Eli Lilly
Curated by ChEMBL
LigandPNGBDBM50053585((S)-4-(amino(carboxy)methyl)-2-hydroxybenzoic acid...)
Affinity DataEC50:  4.80E+4nM. Assay description: Agonist activity at mGlu2 receptor
In DepthDetails ArticlePubMed
TargetMetabotropic glutamate receptor 4(Rattus norvegicus (Rat))
Universit£
Curated by ChEMBL
LigandPNGBDBM50053585((S)-4-(amino(carboxy)methyl)-2-hydroxybenzoic acid...)
Affinity DataEC50: >1.00E+5nM. Assay description: Stimulation of [3H]phosphatidylinositol accumulation by rat Metabotropic glutamate receptor 4 co-expressed with Gqi9 protein in HEK 293 cells; Inacti...
In DepthDetails ArticlePubMed