BDBM50053795 3-(2-Diphenylacetylamino-4-methyl-pentanoylamino)-2-oxo-pentanoic acid (3-morpholin-4-yl-propyl)-amide::CHEMBL132886
SMILES CCC(NC(=O)C(CC(C)C)NC(=O)C(c1ccccc1)c1ccccc1)C(=O)C(=O)NCCCN1CCOCC1
InChI Key InChIKey=YFQOCPUAXDVMOS-UHFFFAOYSA-N
Data  3 KI
  Tab Delimited (TSV)   2D SDfile   Computed 3D by Vconf -m prep SDfile
Find this compound or compounds like it in BindingDB:
Activity Spreadsheet -- Enzyme Inhibition Constant Data from BindingDB
Found 3 hits for monomerid = 50053795
TargetCalpain-2 catalytic subunit(Homo sapiens (Human))
Georgia Institute Of Technology
Curated by ChEMBL
LigandPNGBDBM50053795(3-(2-Diphenylacetylamino-4-methyl-pentanoylamino)-...)
Affinity DataKi:  110nM. Assay description: Compound was evaluated for the inhibition of Cysteine protease Calpain 2
In DepthDetails ArticlePubMed
TargetCalpain-1 catalytic subunit(Homo sapiens (Human))
Georgia Institute Of Technology
Curated by ChEMBL
LigandPNGBDBM50053795(3-(2-Diphenylacetylamino-4-methyl-pentanoylamino)-...)
Affinity DataKi:  800nM. Assay description: Inhibition of the cysteine protease human Calpain 1
In DepthDetails ArticlePubMed
TargetCathepsin B(Homo sapiens (Human))
Georgia Institute Of Technology
Curated by ChEMBL
LigandPNGBDBM50053795(3-(2-Diphenylacetylamino-4-methyl-pentanoylamino)-...)
Affinity DataKi:  2.30E+3nM. Assay description: Inhibition of human cathepsin B
In DepthDetails ArticlePubMed