BDBM50053813 (1-{1-Benzyl-2-oxo-2-[3-(3,4,4a,8a-tetrahydro-1H-isoquinolin-2-yl)-propylcarbamoyl]-ethylcarbamoyl}-3-methyl-butyl)-carbamic acid benzyl ester::CHEMBL133574
SMILES CC(C)CC(NC(=O)OCc1ccccc1)C(=O)NC(Cc1ccccc1)C(=O)C(=O)NCCCN1CCC2C=CC=CC2C1
InChI Key InChIKey=XVYMHUPUYXWRAO-UHFFFAOYSA-N
Data  3 KI
  Tab Delimited (TSV)   2D SDfile   Computed 3D by Vconf -m prep SDfile
Find this compound or compounds like it in BindingDB:
Activity Spreadsheet -- Enzyme Inhibition Constant Data from BindingDB
Found 3 hits for monomerid = 50053813
TargetCalpain-2 catalytic subunit(Homo sapiens (Human))
Georgia Institute Of Technology
Curated by ChEMBL
LigandPNGBDBM50053813((1-{1-Benzyl-2-oxo-2-[3-(3,4,4a,8a-tetrahydro-1H-i...)
Affinity DataKi:  0.200nM. Assay description: Compound was evaluated for the inhibition of Cysteine protease Calpain 2
In DepthDetails ArticlePubMed
TargetCalpain-1 catalytic subunit(Homo sapiens (Human))
Georgia Institute Of Technology
Curated by ChEMBL
LigandPNGBDBM50053813((1-{1-Benzyl-2-oxo-2-[3-(3,4,4a,8a-tetrahydro-1H-i...)
Affinity DataKi:  0.220nM. Assay description: Inhibition of the cysteine protease human Calpain 1
In DepthDetails ArticlePubMed
TargetCathepsin B(Homo sapiens (Human))
Georgia Institute Of Technology
Curated by ChEMBL
LigandPNGBDBM50053813((1-{1-Benzyl-2-oxo-2-[3-(3,4,4a,8a-tetrahydro-1H-i...)
Affinity DataKi:  4.5nM. Assay description: Inhibition of human cathepsin B
In DepthDetails ArticlePubMed