BDBM50053835 (1-{1-[2-Hydroxy-2-(3,4,5-trimethoxy-phenyl)-ethylaminooxalyl]-propylcarbamoyl}-3-methyl-butyl)-carbamic acid benzyl ester::CHEMBL130359
SMILES CCC(NC(=O)C(CC(C)C)NC(=O)OCc1ccccc1)C(=O)C(=O)NCC(O)c1cc(OC)c(OC)c(OC)c1
InChI Key InChIKey=CLBKCGOYQYVDNB-UHFFFAOYSA-N
Data  3 KI
  Tab Delimited (TSV)   2D SDfile   Computed 3D by Vconf -m prep SDfile
Find this compound or compounds like it in BindingDB:
Activity Spreadsheet -- Enzyme Inhibition Constant Data from BindingDB
Found 3 hits for monomerid = 50053835
TargetCalpain-2 catalytic subunit(Homo sapiens (Human))
Georgia Institute Of Technology
Curated by ChEMBL
LigandPNGBDBM50053835((1-{1-[2-Hydroxy-2-(3,4,5-trimethoxy-phenyl)-ethyl...)
Affinity DataKi:  220nM. Assay description: Compound was evaluated for the inhibition of Cysteine protease Calpain 2
In DepthDetails ArticlePubMed
TargetCathepsin B(Bos taurus (bovine))
Georgia Institute Of Technology
Curated by ChEMBL
LigandPNGBDBM50053835((1-{1-[2-Hydroxy-2-(3,4,5-trimethoxy-phenyl)-ethyl...)
Affinity DataKi:  220nM. Assay description: Inhibition of bovine cathepsin B
In DepthDetails ArticlePubMed
TargetCalpain-1 catalytic subunit(Homo sapiens (Human))
Georgia Institute Of Technology
Curated by ChEMBL
LigandPNGBDBM50053835((1-{1-[2-Hydroxy-2-(3,4,5-trimethoxy-phenyl)-ethyl...)
Affinity DataKi:  380nM. Assay description: Inhibition of the cysteine protease human Calpain 1
In DepthDetails ArticlePubMed