BDBM50053999 (E)-6-(8-Hydroxy-6-methoxy-5-methyl-1-oxo-isochroman-7-yl)-4-methyl-hex-4-enoic acid::CHEMBL422804
SMILES COc1c(C)c2CCOC(=O)c2c(O)c1C\C=C(/C)CCC(O)=O
InChI Key InChIKey=LQHNUOKEJCLSGH-ONNFQVAWSA-N
Data  1 IC50
  Tab Delimited (TSV)   2D SDfile   Computed 3D by Vconf -m prep SDfile
Find this compound or compounds like it in BindingDB:
Activity Spreadsheet -- Enzyme Inhibition Constant Data from BindingDB
Found 1 hit for monomerid = 50053999
TargetInosine-5'-monophosphate dehydrogenase 2(Homo sapiens (Human))
Syntex Research
Curated by ChEMBL
LigandPNGBDBM50053999((E)-6-(8-Hydroxy-6-methoxy-5-methyl-1-oxo-isochrom...)
Affinity DataIC50:  644nMpH: 8.0Assay Description:Inhibition of human recombinant type II Inosine Monophosphate Dehydrogenase. at pH 8.0
In DepthDetails ArticlePubMed