BDBM50054020 (E)-6-(3-Chloro-2-hydroxy-4,5,6-trimethyl-phenyl)-4-methyl-hex-4-enoic acid::CHEMBL335446
SMILES C\C(CCC(O)=O)=C/Cc1c(C)c(C)c(C)c(Cl)c1O
InChI Key InChIKey=PNRIFCXDNGKXPV-WEVVVXLNSA-N
Data  1 IC50
  Tab Delimited (TSV)   2D SDfile   Computed 3D by Vconf -m prep SDfile
Find this compound or compounds like it in BindingDB:
Activity Spreadsheet -- Enzyme Inhibition Constant Data from BindingDB
Found 1 hit for monomerid = 50054020
TargetInosine-5'-monophosphate dehydrogenase 2(Homo sapiens (Human))
Syntex Research
Curated by ChEMBL
LigandPNGBDBM50054020((E)-6-(3-Chloro-2-hydroxy-4,5,6-trimethyl-phenyl)-...)
Affinity DataIC50:  69.3nM. Assay description: Inhibition of human recombinant inosine monophosphate dehydrogenase type II .
In DepthDetails ArticlePubMed