BDBM50054112 CHEMBL135530::[4-(3,4-Dihydro-naphthalen-1-yl)-butyl]-dipropyl-amine
SMILES CCCN(CCC)CCCCC1=CCCc2ccccc12
InChI Key InChIKey=CICRTVAOKJIVPR-UHFFFAOYSA-N
Data  1 KI
  Tab Delimited (TSV)   2D SDfile   Computed 3D by Vconf -m prep SDfile
Find this compound or compounds like it in BindingDB:
Activity Spreadsheet -- Enzyme Inhibition Constant Data from BindingDB
Found 1 hit for monomerid = 50054112
Target5-hydroxytryptamine receptor 1A(Rattus norvegicus (rat))
Universit£
Curated by ChEMBL
LigandPNGBDBM50054112(CHEMBL135530 | [4-(3,4-Dihydro-naphthalen-1-yl)-bu...)
Affinity DataKi:  357nM. Assay description: Binding affinity was tested on 5-hydroxytryptamine 1A receptor using radioligand [3H]5-HT binding assay.
In DepthDetails ArticlePubMed