BDBM50054221 CHEMBL419636::N,N-Dibutyl-6-methyl-N'-(2,4,6-trimethyl-phenyl)-[1,3,5]triazine-2,4-diamine
SMILES CCCCN(CCCC)c1nc(C)nc(Nc2c(C)cc(C)cc2C)n1
InChI Key InChIKey=YDIVVGPEMJITAB-UHFFFAOYSA-N
Data  2 KI
  Tab Delimited (TSV)   2D SDfile   Computed 3D by Vconf -m prep SDfile
Find this compound or compounds like it in BindingDB:
Activity Spreadsheet -- Enzyme Inhibition Constant Data from BindingDB
Found 2 hits for monomerid = 50054221
TargetCorticotropin-releasing factor receptor 1(Homo sapiens (Human))
The University Of Wollongong
Curated by ChEMBL
LigandPNGBDBM50054221(CHEMBL419636 | N,N-Dibutyl-6-methyl-N'-(2,4,6-trim...)
Affinity DataKi:  490nM. Assay description: Inhibition of [125I]-CRH binding to human Corticotropin releasing factor receptor 1.
In DepthDetails ArticlePubMed
TargetCorticotropin-releasing factor receptor 1(Homo sapiens (Human))
The University Of Wollongong
Curated by ChEMBL
LigandPNGBDBM50054221(CHEMBL419636 | N,N-Dibutyl-6-methyl-N'-(2,4,6-trim...)
Affinity DataKi:  490nM. Assay description: Inhibition of [125I]-CRF binding to human corticotropin releasing factor receptor 1
In DepthDetails ArticlePubMed