BDBM50054362 2-{4-[4-(2-Methoxy-phenyl)-piperazin-1-yl]-butyl}-tetrahydro-imidazo[1,5-a]pyridine-1,3-dione::CHEMBL46881
SMILES COc1ccccc1N1CCN(CCCCn2c(O)c3CCCCn3c2=O)CC1
InChI Key InChIKey=IICAHJWMSPQGQW-UHFFFAOYSA-N
Data  7 KI
  Tab Delimited (TSV)   2D SDfile   Computed 3D by Vconf -m prep SDfile
Find this compound or compounds like it in BindingDB:
Activity Spreadsheet -- Enzyme Inhibition Constant Data from BindingDB
Found 7 hits for monomerid = 50054362
TargetAlpha-1A adrenergic receptor(Rattus norvegicus (Rat))
Universidad Complutense
Curated by ChEMBL
LigandPNGBDBM50054362(2-{4-[4-(2-Methoxy-phenyl)-piperazin-1-yl]-butyl}-...)
Affinity DataKi:  8.60nM. Assay description: Binding affinities against Alpha-1 adrenergic receptor (alpha1 adrenoceptor) using [3H]-prazosin as radioligand in rat cerebral cortex membrane
In DepthDetails ArticlePubMed
TargetAlpha-1A/Alpha-1B/Alpha-1D adrenergic receptor(Rattus norvegicus (rat))
TBA
Curated by ChEMBL
LigandPNGBDBM50054362(2-{4-[4-(2-Methoxy-phenyl)-piperazin-1-yl]-butyl}-...)
Affinity DataKi:  8.60nM. Assay description: Binding affinity at Alpha-1 adrenergic receptor in rat cerebral cortex membranes by [3H]prazosin displacement.
In DepthDetails Article
Target5-hydroxytryptamine receptor 1A(Rattus norvegicus (rat))
Universidad Complutense
Curated by ChEMBL
LigandPNGBDBM50054362(2-{4-[4-(2-Methoxy-phenyl)-piperazin-1-yl]-butyl}-...)
Affinity DataKi:  8.80nM. Assay description: Binding affinities against 5-hydroxytryptamine 1A receptor using [3H]-8-OH-DPAT as radioligand in rat cerebral cortex membrane
In DepthDetails ArticlePubMed
Target5-hydroxytryptamine receptor 1A(Rattus norvegicus (rat))
Universidad Complutense
Curated by ChEMBL
LigandPNGBDBM50054362(2-{4-[4-(2-Methoxy-phenyl)-piperazin-1-yl]-butyl}-...)
Affinity DataKi:  8.80nM. Assay description: Tested in vitro for binding affinity by measuring its ability to inhibit [3H]8-OH-DPAT binding at 5-hydroxytryptamine 1A receptor in rat cerebral cor...
In DepthDetails ArticlePubMed
Target5-hydroxytryptamine receptor 1A(Rattus norvegicus (rat))
Universidad Complutense
Curated by ChEMBL
LigandPNGBDBM50054362(2-{4-[4-(2-Methoxy-phenyl)-piperazin-1-yl]-butyl}-...)
Affinity DataKi:  8.80nM. Assay description: Binding affinity at 5-hydroxytryptamine 1A receptor in rat cerebral cortex membranes by [3H]-8-OH-DPAT displacement.
In DepthDetails Article
Target5-hydroxytryptamine receptor 1A(Rattus norvegicus (rat))
Universidad Complutense
Curated by ChEMBL
LigandPNGBDBM50054362(2-{4-[4-(2-Methoxy-phenyl)-piperazin-1-yl]-butyl}-...)
Affinity DataKi:  8.80nM. Assay description: Binding affinity towards rat 5-hydroxytryptamine 1A receptor using [3H]-8-OH-DPAT radioligand.
In DepthDetails ArticlePubMed
TargetD(2) dopamine receptor(Rattus norvegicus (rat))
Universidad Complutense
Curated by ChEMBL
LigandPNGBDBM50054362(2-{4-[4-(2-Methoxy-phenyl)-piperazin-1-yl]-butyl}-...)
Affinity DataKi: >1.00E+3nM. Assay description: Binding affinity towards dopamine receptor D2 using [3H]-raclopride radioligand.
In DepthDetails ArticlePubMed