BDBM50054418 1,11-dichloro-6,7,12,13-tetrahydro-5H-indolo[2,3-a]pyrrolo[3,4-c]carbazol-5-one::CHEMBL335822
SMILES Clc1cccc2c1[nH]c1c3[nH]c4c(Cl)cccc4c3c3C(=O)NCc3c21
InChI Key InChIKey=DXQUFHKBMSFBNT-UHFFFAOYSA-N
Data  1 IC50
  Tab Delimited (TSV)   2D SDfile   Computed 3D by Vconf -m prep SDfile
Find this compound or compounds like it in BindingDB:
Activity Spreadsheet -- Enzyme Inhibition Constant Data from BindingDB
Found 1 hit for monomerid = 50054418
TargetProtein kinase C alpha type(Homo sapiens (Human))
Université
Curated by ChEMBL
LigandPNGBDBM50054418(1,11-dichloro-6,7,12,13-tetrahydro-5H-indolo[2,3-a...)
Affinity DataIC50: >1.00E+5nM. Assay description: Inhibition of Protein Kinase C(PKC)
In DepthDetails ArticlePubMed