BDBM50054423 1,11-dichloro-13-(3,4-dihydroxy-6-hydroxymethyl-5-methoxytetrahydro-2H-2-pyranyl)-6,7,12,13-tetrahydro-5H-indolo[2,3-a]pyrrolo[3,4-c]carbazol-5-one::CHEMBL343788
SMILES COC1C(O)C(O)C(OC1CO)n1c2c(Cl)cccc2c2c3C(=O)NCc3c3c4cccc(Cl)c4[nH]c3c12
InChI Key InChIKey=FDNDTODTDPFKCS-UHFFFAOYSA-N
Data  1 IC50
  Tab Delimited (TSV)   2D SDfile   Computed 3D by Vconf -m prep SDfile
Find this compound or compounds like it in BindingDB:
Activity Spreadsheet -- Enzyme Inhibition Constant Data from BindingDB
Found 1 hit for monomerid = 50054423
TargetProtein kinase C alpha type(Homo sapiens (Human))
Université
Curated by ChEMBL
LigandPNGBDBM50054423(1,11-dichloro-13-(3,4-dihydroxy-6-hydroxymethyl-5-...)
Affinity DataIC50:  2.88E+4nM. Assay description: Inhibition of Protein Kinase C(PKC)
In DepthDetails ArticlePubMed