BDBM50054456 CHEMBL3323079
SMILES CCOC(=O)c1ccc(nc1)[C@]1(N[C@H](Cc2c1[nH]c1ccccc21)c1nc(c[nH]1)-c1ccc(F)cc1)c1cnn(C)c1
InChI Key
Data  4 IC50
  Tab Delimited (TSV)   2D SDfile   Computed 3D by Vconf -m prep SDfile
Find this compound or compounds like it in BindingDB:
Activity Spreadsheet -- Enzyme Inhibition Constant Data from BindingDB
Found 4 hits for monomerid = 50054456
TargetSomatostatin receptor type 3(Homo sapiens (Human))
Merck Research Laboratories
Curated by ChEMBL
LigandPNGBDBM50054456(CHEMBL3323079)
Affinity DataIC50:  2.90nM. Assay description: Displacement of [125I]SS-14 from human SSTR3 expressed in CHO cells by TopCount analyzer
In DepthDetails ArticlePubMed
TargetSomatostatin receptor type 3(Homo sapiens (Human))
Merck Research Laboratories
Curated by ChEMBL
LigandPNGBDBM50054456(CHEMBL3323079)
Affinity DataIC50:  32nM. Assay description: Antagonist activity at human SSTR3 expressed in CHO cells assessed as cAMP level by fluorescence analysis
In DepthDetails ArticlePubMed
TargetSomatostatin receptor type 3(MOUSE)
Merck Research Laboratories
Curated by ChEMBL
LigandPNGBDBM50054456(CHEMBL3323079)
Affinity DataIC50:  14nM. Assay description: Antagonist activity at mouse SSTR3 expressed in CHO cells assessed as cAMP level by fluorescence analysis
In DepthDetails ArticlePubMed
TargetPotassium voltage-gated channel subfamily H member 2(Homo sapiens (Human))
Merck Research Laboratories
Curated by ChEMBL
LigandPNGBDBM50054456(CHEMBL3323079)
Affinity DataIC50:  2.85E+3nM. Assay description: Inhibition of human ERG by MK-499 displacement binding analysis
In DepthDetails ArticlePubMed