BDBM50054486 CHEMBL141424::N-[(S)-1-((S)-1-Carbamimidoyl-piperidin-3-ylmethyl)-2-oxo-ethyl]-2-((S)-2-oxo-3-phenylmethanesulfonylamino-piperidin-1-yl)-acetamide
SMILES NC(=N)N1CCC[C@@H](C[C@H](NC(=O)CN2CCC[C@H](NS(=O)(=O)Cc3ccccc3)C2=O)C=O)C1
InChI Key InChIKey=DATYERRDSFNBDN-UFYCRDLUSA-N
Data  3 IC50
PDB links: 2 PDB IDs match this monomer.
  Tab Delimited (TSV)   2D SDfile   Computed 3D by Vconf -m prep SDfile
Find this compound or compounds like it in BindingDB:
Activity Spreadsheet -- Enzyme Inhibition Constant Data from BindingDB
Found 3 hits for monomerid = 50054486
TargetAnionic trypsin(Bos taurus)
Corvas International
Curated by ChEMBL
LigandPNGBDBM50054486(CHEMBL141424 | N-[(S)-1-((S)-1-Carbamimidoyl-piper...)
Affinity DataIC50:  6.48E+4nM. Assay description: Compound was evaluated for inhibition of amidolytic activity for chromogenic substrate trypsin
In DepthDetails ArticlePubMed
TargetProthrombin(Homo sapiens (Human))
Corvas International
Curated by ChEMBL
LigandPNGBDBM50054486(CHEMBL141424 | N-[(S)-1-((S)-1-Carbamimidoyl-piper...)
Affinity DataIC50:  0.670nM. Assay description: Compound was evaluated for inhibition of amidolytic activity for chromogenic substrate thrombin F11a.
TargetCoagulation factor X(Homo sapiens (Human))
Corvas International
Curated by ChEMBL
LigandPNGBDBM50054486(CHEMBL141424 | N-[(S)-1-((S)-1-Carbamimidoyl-piper...)
Affinity DataIC50: >2.50E+4nM. Assay description: Compound was evaluated for inhibition of amidolytic activity for chromogenic substrate Coagulation factor X
In DepthDetails ArticlePubMed